request

🏊🏾 Simplified HTTP request client. (by request)

Request Alternatives

Similar projects and alternatives to request

NOTE: The number of mentions on this list indicates mentions on common posts plus user suggested alternatives. Hence, a higher number means a better request alternative or higher similarity.

request reviews and mentions

Posts with mentions or reviews of request. We have used some of these posts to build our list of alternatives and similar projects. The last one was on 2023-01-29.
  • one of my coworkers criticised me for using too shiny libraries.
    3 projects | reddit.com/r/reactjs | 29 Jan 2023
    request was deprecated in 2020 and still has 16 million weekly downloads.
  • The project works flawlessly on Windows but just wouldn't on M1 Mac
    5 projects | reddit.com/r/node | 14 Nov 2022
    npm WARN old lockfile npm WARN old lockfile The package-lock.json file was created with an old version of npm, npm WARN old lockfile so supplemental metadata must be fetched from the registry. npm WARN old lockfile npm WARN old lockfile This is a one-time fix-up, please be patient... npm WARN old lockfile npm WARN deprecated [email protected]: Modern JS already guarantees Array#sort() is a stable sort, so this library is deprecated. See the compatibility table on MDN: https://developer.mozilla.org/en-US/docs/Web/JavaScript/Reference/Global_Objects/Array/sort#browser_compatibility npm WARN deprecated [email protected]: this library is no longer supported npm WARN deprecated [email protected]: See https://github.com/lydell/source-map-resolve#deprecated npm WARN deprecated [email protected]: Please upgrade to version 7 or higher. Older versions may use Math.random() in certain circumstances, which is known to be problematic. See https://v8.dev/blog/math-random for details. npm WARN deprecated [email protected]: request has been deprecated, see https://github.com/request/request/issues/3142 npm WARN deprecated [email protected]: support for ECMAScript is superseded by `uglify-js` as of v3.13.0 npm WARN deprecated [email protected]: This SVGO version is no longer supported. Upgrade to v2.x.x. npm WARN deprecated [email protected]: This version of tar is no longer supported, and will not receive security updates. Please upgrade asap. npm WARN deprecated [email protected]: Please see https://github.com/lydell/urix#deprecated npm WARN deprecated [email protected]: https://github.com/lydell/resolve-url#deprecated npm WARN deprecated [email protected]: deprecated npm WARN deprecated [email protected]: Browserslist 2 could fail on reading Browserslist >3.0 config used in other tools. npm WARN deprecated [email protected]: See https://github.com/lydell/source-map-url#deprecated npm WARN cleanup Failed to remove some directories [ npm WARN cleanup [ npm WARN cleanup '/Users/bhavesh_1thing/Desktop/WDP/Onething Design/1Thing/India-AI-2021/node_modules', npm WARN cleanup [Error: ENOTEMPTY: directory not empty, rmdir '/Users/bhavesh_1thing/Desktop/WDP/Onething Design/1Thing/India-AI-2021/node_modules/gifsicle'] { npm WARN cleanup errno: -66, npm WARN cleanup code: 'ENOTEMPTY', npm WARN cleanup syscall: 'rmdir', npm WARN cleanup path: '/Users/bhavesh_1thing/Desktop/WDP/Onething Design/1Thing/India-AI-2021/node_modules/gifsicle' npm WARN cleanup } npm WARN cleanup ], npm WARN cleanup [ npm WARN cleanup '/Users/bhavesh_1thing/Desktop/WDP/Onething Design/1Thing/India-AI-2021/node_modules/gifsicle', npm WARN cleanup [Error: ENOTEMPTY: directory not empty, rmdir '/Users/bhavesh_1thing/Desktop/WDP/Onething Design/1Thing/India-AI-2021/node_modules/gifsicle'] { npm WARN cleanup errno: -66, npm WARN cleanup code: 'ENOTEMPTY', npm WARN cleanup syscall: 'rmdir', npm WARN cleanup path: '/Users/bhavesh_1thing/Desktop/WDP/Onething Design/1Thing/India-AI-2021/node_modules/gifsicle' npm WARN cleanup } npm WARN cleanup ] npm WARN cleanup ] npm ERR! code 1 npm ERR! path /Users/bhavesh_1thing/Desktop/WDP/Onething Design/1Thing/India-AI-2021/node_modules/node-sass npm ERR! command failed npm ERR! command sh -c node scripts/build.js npm ERR! Building: /opt/homebrew/Cellar/node/19.0.1/bin/node /Users/bhavesh_1thing/Desktop/WDP/Onething Design/1Thing/India-AI-2021/node_modules/node-gyp/bin/node-gyp.js rebuild --verbose --libsass_ext= --libsass_cflags= --libsass_ldflags= --libsass_library= npm ERR! gyp info it worked if it ends with ok npm ERR! gyp verb cli [ npm ERR! gyp verb cli '/opt/homebrew/Cellar/node/19.0.1/bin/node', npm ERR! gyp verb cli '/Users/bhavesh_1thing/Desktop/WDP/Onething Design/1Thing/India-AI-2021/node_modules/node-gyp/bin/node-gyp.js', npm ERR! gyp verb cli 'rebuild', npm ERR! gyp verb cli '--verbose', npm ERR! gyp verb cli '--libsass_ext=', npm ERR! gyp verb cli '--libsass_cflags=', npm ERR! gyp verb cli '--libsass_ldflags=', npm ERR! gyp verb cli '--libsass_library=' npm ERR! gyp verb cli ] npm ERR! gyp info using [email protected] npm ERR! gyp info using [email protected] | darwin | arm64 npm ERR! gyp verb command rebuild [] npm ERR! gyp verb command clean [] npm ERR! gyp verb clean removing "build" directory npm ERR! gyp verb command configure [] npm ERR! gyp verb check python checking for Python executable "python2" in the PATH npm ERR! gyp verb `which` failed Error: not found: python2 npm ERR! gyp verb `which` failed at getNotFoundError (/Users/bhavesh_1thing/Desktop/WDP/Onething Design/1Thing/India-AI-2021/node_modules/which/which.js:13:12) npm ERR! gyp verb `which` failed at F (/Users/bhavesh_1thing/Desktop/WDP/Onething Design/1Thing/India-AI-2021/node_modules/which/which.js:68:19) npm ERR! gyp verb `which` failed at E (/Users/bhavesh_1thing/Desktop/WDP/Onething Design/1Thing/India-AI-2021/node_modules/which/which.js:80:29) npm ERR! gyp verb `which` failed at /Users/bhavesh_1thing/Desktop/WDP/Onething Design/1Thing/India-AI-2021/node_modules/which/which.js:89:16 npm ERR! gyp verb `which` failed at /Users/bhavesh_1thing/Desktop/WDP/Onething Design/1Thing/India-AI-2021/node_modules/isexe/index.js:42:5 npm ERR! gyp verb `which` failed at /Users/bhavesh_1thing/Desktop/WDP/Onething Design/1Thing/India-AI-2021/node_modules/isexe/mode.js:8:5 npm ERR! gyp verb `which` failed at FSReqCallback.oncomplete (node:fs:199:21) npm ERR! gyp verb `which` failed python2 Error: not found: python2 npm ERR! gyp verb `which` failed at getNotFoundError (/Users/bhavesh_1thing/Desktop/WDP/Onething Design/1Thing/India-AI-2021/node_modules/which/which.js:13:12) npm ERR! gyp verb `which` failed at F (/Users/bhavesh_1thing/Desktop/WDP/Onething Design/1Thing/India-AI-2021/node_modules/which/which.js:68:19) npm ERR! gyp verb `which` failed at E (/Users/bhavesh_1thing/Desktop/WDP/Onething Design/1Thing/India-AI-2021/node_modules/which/which.js:80:29) npm ERR! gyp verb `which` failed at /Users/bhavesh_1thing/Desktop/WDP/Onething Design/1Thing/India-AI-2021/node_modules/which/which.js:89:16 npm ERR! gyp verb `which` failed at /Users/bhavesh_1thing/Desktop/WDP/Onething Design/1Thing/India-AI-2021/node_modules/isexe/index.js:42:5 npm ERR! gyp verb `which` failed at /Users/bhavesh_1thing/Desktop/WDP/Onething Design/1Thing/India-AI-2021/node_modules/isexe/mode.js:8:5 npm ERR! gyp verb `which` failed at FSReqCallback.oncomplete (node:fs:199:21) { npm ERR! gyp verb `which` failed code: 'ENOENT' npm ERR! gyp verb `which` failed } npm ERR! gyp verb check python checking for Python executable "python" in the PATH npm ERR! gyp verb `which` failed Error: not found: python npm ERR! gyp verb `which` failed at getNotFoundError (/Users/bhavesh_1thing/Desktop/WDP/Onething Design/1Thing/India-AI-2021/node_modules/which/which.js:13:12) npm ERR! gyp verb `which` failed at F (/Users/bhavesh_1thing/Desktop/WDP/Onething Design/1Thing/India-AI-2021/node_modules/which/which.js:68:19) npm ERR! gyp verb `which` failed at E (/Users/bhavesh_1thing/Desktop/WDP/Onething Design/1Thing/India-AI-2021/node_modules/which/which.js:80:29) npm ERR! gyp verb `which` failed at /Users/bhavesh_1thing/Desktop/WDP/Onething Design/1Thing/India-AI-2021/node_modules/which/which.js:89:16 npm ERR! gyp verb `which` failed at /Users/bhavesh_1thing/Desktop/WDP/Onething Design/1Thing/India-AI-2021/node_modules/isexe/index.js:42:5 npm ERR! gyp verb `which` failed at /Users/bhavesh_1thing/Desktop/WDP/Onething Design/1Thing/India-AI-2021/node_modules/isexe/mode.js:8:5 npm ERR! gyp verb `which` failed at FSReqCallback.oncomplete (node:fs:199:21) npm ERR! gyp verb `which` failed python Error: not found: python npm ERR! gyp verb `which` failed at getNotFoundError (/Users/bhavesh_1thing/Desktop/WDP/Onething Design/1Thing/India-AI-2021/node_modules/which/which.js:13:12) npm ERR! gyp verb `which` failed at F (/Users/bhavesh_1thing/Desktop/WDP/Onething Design/1Thing/India-AI-2021/node_modules/which/which.js:68:19) npm ERR! gyp verb `which` failed at E (/Users/bhavesh_1thing/Desktop/WDP/Onething Design/1Thing/India-AI-2021/node_modules/which/which.js:80:29) npm ERR! gyp verb `which` failed at /Users/bhavesh_1thing/Desktop/WDP/Onething Design/1Thing/India-AI-2021/node_modules/which/which.js:89:16 npm ERR! gyp verb `which` failed at /Users/bhavesh_1thing/Desktop/WDP/Onething Design/1Thing/India-AI-2021/node_modules/isexe/index.js:42:5 npm ERR! gyp verb `which` failed at /Users/bhavesh_1thing/Desktop/WDP/Onething Design/1Thing/India-AI-2021/node_modules/isexe/mode.js:8:5 npm ERR! gyp verb `which` failed at FSReqCallback.oncomplete (node:fs:199:21) { npm ERR! gyp verb `which` failed code: 'ENOENT' npm ERR! gyp verb `which` failed } npm ERR! gyp ERR! configure error npm ERR! gyp ERR! stack Error: Can't find Python executable "python", you can set the PYTHON env variable. npm ERR! gyp ERR! stack at PythonFinder.failNoPython (/Users/bhavesh_1thing/Desktop/WDP/Onething Design/1Thing/India-AI-2021/node_modules/node-gyp/lib/configure.js:484:19) npm ERR! gyp ERR! stack at PythonFinder. (/Users/bhavesh_1thing/Desktop/WDP/Onething Design/1Thing/India-AI-2021/node_modules/node-gyp/lib/configure.js:406:16) npm ERR! gyp ERR! stack at F (/Users/bhavesh_1thing/Desktop/WDP/Onething Design/1Thing/India-AI-2021/node_modules/which/which.js:68:16) npm ERR! gyp ERR! stack at E (/Users/bhavesh_1thing/Desktop/WDP/Onething Design/1Thing/India-AI-2021/node_modules/which/which.js:80:29) npm ERR! gyp ERR! stack at /Users/bhavesh_1thing/Desktop/WDP/Onething Design/1Thing/India-AI-2021/node_modules/which/which.js:89:16 npm ERR! gyp ERR! stack at /Users/bhavesh_1thing/Desktop/WDP/Onething Design/1Thing/India-AI-2021/node_modules/isexe/index.js:42:5 npm ERR! gyp ERR! stack at /Users/bhavesh_1thing/Desktop/WDP/Onething Design/1Thing/India-AI-2021/node_modules/isexe/mode.js:8:5 npm ERR! gyp ERR! stack at FSReqCallback.oncomplete (node:fs:199:21) npm ERR! gyp ERR! System Darwin 21.6.0 npm ERR! gyp ERR! command "/opt/homebrew/Cellar/node/19.0.1/bin/node" "/Users/bhavesh_1thing/Desktop/WDP/Onething Design/1Thing/India-AI-2021/node_modules/node-gyp/bin/node-gyp.js" "rebuild" "--verbose" "--libsass_ext=" "--libsass_cflags=" "--libsass_ldflags=" "--libsass_library=" npm ERR! gyp ERR! cwd /Users/bhavesh_1thing/Desktop/WDP/Onething Design/1Thing/India-AI-2021/node_modules/node-sass npm ERR! gyp ERR! node -v v19.0.1 npm ERR! gyp ERR! node-gyp -v v3.8.0 npm ERR! gyp ERR! not ok npm ERR! Build failed with error code: 1 npm ERR! A complete log of this run can be found in: npm ERR! /Users/bhavesh_1thing/.npm/_logs/2022-11-14T12_53_01_446Z-debug-0.log
  • Getting an error when typing npm install
    6 projects | reddit.com/r/reactnative | 5 Aug 2022
    npm WARN deprecated [email protected]: This version of React Navigation Stack is no longer supported. Please upgrade to 2.x.x. See https://reactnavigation.org/docs/4.x/upgrading-from-3.x#react-navigation-stack for instructions. npm WARN deprecated [email protected]: Package moved to @redux-devtools/extension. npm WARN deprecated [email protected]: babel-eslint is now @babel/eslint-parser. This package will no longer receive updates. npm WARN deprecated [email protected]: [email protected]<3.23.3 is no longer maintained and not recommended for usage due to the number of issues. Because of the V8 engine whims, feature detection in old core-js versions could cause a slowdown up to 100x even if nothing is polyfilled. Some versions have web compatibility issues. Please, upgrade your dependencies to the actual version of core-js. npm WARN deprecated @hapi/[email protected]: Switch to 'npm install joi' npm WARN deprecated [email protected]: some dependency vulnerabilities fixed, support for node < 10 dropped, and newer ECMAScript syntax/features added npm WARN deprecated [email protected]: fsevents 1 will break on node v14+ and could be using insecure binaries. Upgrade to fsevents 2. npm WARN deprecated [email protected]: Please upgrade to version 7 or higher. Older versions may use Math.random() in certain circumstances, which is known to be problematic. See https://v8.dev/blog/math-random for details. npm WARN deprecated @hapi/[email protected]: Moved to 'npm install @sideway/address' npm WARN deprecated @hapi/[email protected]: This version has been deprecated and is no longer supported or maintained npm WARN deprecated @hapi/[email protected]: This version has been deprecated and is no longer supported or maintained npm WARN deprecated @hapi/[email protected]: This version has been deprecated and is no longer supported or maintained npm WARN deprecated [email protected]: The querystring API is considered Legacy. new code should use the URLSearchParams API instead. npm WARN deprecated [email protected]: See https://github.com/lydell/source-map-resolve#deprecated npm WARN deprecated [email protected]: support for ECMAScript is superseded by `uglify-js` as of v3.13.0 npm WARN deprecated [email protected]: request-promise-native has been deprecated because it extends the now deprecated request package, see https://github.com/request/request/issues/3142 npm WARN deprecated [email protected]: request has been deprecated, see https://github.com/request/request/issues/3142 npm WARN deprecated [email protected]: use String.prototype.padStart() npm WARN deprecated [email protected]: Please see https://github.com/lydell/urix#deprecated npm WARN deprecated [email protected]: https://github.com/lydell/resolve-url#deprecated npm WARN deprecated [email protected]: See https://github.com/lydell/source-map-url#deprecated npm WARN deprecated [email protected]: this library is no longer supported npm ERR! code ENOENT npm ERR! syscall spawn git npm ERR! path git npm ERR! errno -4058 npm ERR! enoent Error while executing: npm ERR! enoent undefined ls-remote -h -t https://github.com/ajency/RNSwipeVerify.git npm ERR! enoent npm ERR! enoent npm ERR! enoent spawn git ENOENT npm ERR! enoent This is related to npm not being able to find a file. npm ERR! enoent
  • Fetch Content of ICS (iCalendar) File from URL in JavaScript
    2 projects | reddit.com/r/learnjavascript | 5 Jun 2022
    To fetch content of some url you may use libraries like https://www.npmjs.com/package/node-fetch. Here is a list of other options: https://github.com/request/request/issues/3143
  • npm/yarn/pnpm fail to do a local install
    10 projects | reddit.com/r/NixOS | 15 Apr 2022
    WARN  deprecated [email protected]: babel-eslint is now @babel/eslint-parser. This package will no longer receive updates.  WARN  deprecated [email protected]: This package has been deprecated and is no longer maintained. Please use @rollup/plugin-babel.  WARN  deprecated @formatjs/[email protected]: the package is rather renamed to @formatjs/ecma-abstract with some changes in functionality (primarily selectUnit is removed and we don't plan to make anyfurther changes to this package  WARN  deprecated [email protected]: We've written a new parser that's 6x faster and is backwards compatible. Please use @formatjs/icu-messageformat-parser  WARN  deprecated [email protected]: This SVGO version is no longer supported. Upgrade to v2.x.x.  WARN  deprecated [email protected]: request has been deprecated, see https://github.com/request/request/issues/3142  WARN  deprecated @formatjs/[email protected]: the package is rather renamed to @formatjs/ecma-abstract with some changes in functionality (primarily selectUnit is removed and we don't plan to make anyfurther changes to this package  WARN  deprecated [email protected]: We've written a new parser that's 6x faster and is backwards compatible. Please use @formatjs/icu-messageformat-parser  WARN  deprecated @formatjs/[email protected]: the package is rather renamed to @formatjs/ecma-abstract with some changes in functionality (primarily selectUnit is removed and we don't plan to make anyfurther changes to this package  WARN  deprecated @formatjs/[email protected]: the package is rather renamed to @formatjs/ecma-abstract with some changes in functionality (primarily selectUnit is removed and we don't plan to make anyfurther changes to this package  WARN  deprecated @formatjs/[email protected]: the package is rather renamed to @formatjs/ecma-abstract with some changes in functionality (primarily selectUnit is removed and we don't plan to make anyfurther changes to this package  WARN  deprecated @formatjs/[email protected]: the package is rather renamed to @formatjs/ecma-abstract with some changes in functionality (primarily selectUnit is removed and we don't plan to make anyfurther changes to this package  WARN  deprecated [email protected]: some dependency vulnerabilities fixed, support for node < 10 dropped, and newer ECMAScript syntax/features added  WARN  deprecated [email protected]: Chokidar 2 does not receive security updates since 2019. Upgrade to chokidar 3 with 15x fewer dependencies  WARN  deprecated [email protected]: See https://github.com/lydell/source-map-resolve#deprecated  WARN  deprecated [email protected]: The querystring API is considered Legacy. new code should use the URLSearchParams API instead.  WARN  deprecated [email protected]: this library is no longer supported  WARN  deprecated [email protected]: Please upgrade to version 7 or higher. Older versions may use Math.random() in certain circumstances, which is known to be problematic. See https://v8.dev/blog/math-random for details.  WARN  deprecated [email protected]: request has been deprecated, see https://github.com/request/request/issues/3142  WARN  deprecated [email protected]: This version of tar is no longer supported, and will not receive security updates. Please upgrade asap.  WARN  deprecated [email protected]: fsevents 1 will break on node v14+ and could be using insecure binaries. Upgrade to fsevents 2.  WARN  deprecated [email protected]: Please upgrade to version 7 or higher. Older versions may use Math.random() in certain circumstances, which is known to be problematic. See https://v8.dev/blog/math-random for details.  WARN  deprecated [email protected]: https://github.com/lydell/resolve-url#deprecated  WARN  deprecated [email protected]: See https://github.com/lydell/source-map-url#deprecated  WARN  deprecated [email protected]: Please see https://github.com/lydell/urix#deprecated  WARN  deprecated [email protected]: This SVGO version is no longer supported. Upgrade to v2.x.x.  WARN  deprecated [email protected]: The querystring API is considered Legacy. new code should use the URLSearchParams API instead.  WARN  deprecated [email protected]: Please upgrade to version 7 or higher. Older versions may use Math.random() in certain circumstances, which is known to be problematic. See https://v8.dev/blog/math-random for details. Packages: +2055 +++++++++++++++++++++++++++++++++++++++++++++++++++++++++++++++++++++++++++++++++++++++++++++++++++++++++++++++++++++++++++++++++++++++++++++++++++++++++++++++++++++++++++++++++++++++++++++++++++++++ Packages are hard linked from the content-addressable store to the virtual store. Content-addressable store is at: /home/marcel/.pnpm-store/v3 Virtual store is at: node_modules/.pnpm Progress: resolved 2057, reused 2055, downloaded 0, added 2055, done node_modules/.pnpm/[email protected]/node_modules/core-js-pure: Running postinstall script, done in 73ms node_modules/.pnpm/[email protected]/node_modules/core-js: Running postinstall script, done in 95ms node_modules/.pnpm/[email protected]/node_modules/cwebp-bin: Running postinstall script... node_modules/.pnpm/[email protected]/node_modules/gifsicle: Running postinstall script... node_modules/.pnpm/[email protected]/node_modules/husky: Running install script, done in 121ms node_modules/.pnpm/[email protected]/node_modules/mozjpeg: Running postinstall script... node_modules/.pnpm/[email protected]/node_modules/node-sass: Running install script, done in 882ms node_modules/.pnpm/[email protected]/node_modules/husky: Running postinstall script, done in 67ms node_modules/.pnpm/[email protected]/node_modules/optipng-bin: Running postinstall script, failed in 934ms .../node_modules/optipng-bin postinstall$ node lib/install.js │ ⚠ spawn /home/marcel/clones/work/ui/node_modules/.pnpm/[email protected]/node_modules/optipng-bin/vendor/optipng ENOENT │ ⚠ optipng pre-build test failed │ ℹ compiling from source │ ✖ Error: Command failed: /bin/sh -c ./configure --with-system-zlib --prefix="/home/marcel/clones/work/ui/node_modules/.pnpm/[email protected]/node_modules/optipng-bin/vendor" --bindir="/home/marc │ Checking for gcc... │ Using pre-configured libpng... │ Checking for system zlib... │ ./configure: error: missing zlib or incorrect zlib version │ ./configure: note: zlib version 1.2.1 or higher is required │ at /home/marcel/clones/work/ui/node_modules/.pnpm/[email protected]/node_modules/execa/index.js:231:11 │ at runMicrotasks () │ at processTicksAndRejections (internal/process/task_queues.js:95:5) │ at async Promise.all (index 0) └─ Failed in 934ms node_modules/.pnpm/[email protected]/node_modules/node-sass: Running postinstall script...  ELIFECYCLE  Command failed with exit code 1.
    10 projects | reddit.com/r/NixOS | 15 Apr 2022
    WARN  Moving @babel/cli that was installed by a different package manager to "node_modules/.ignored  WARN  Moving @babel/core that was installed by a different package manager to "node_modules/.ignored  WARN  Moving @rollup/plugin-alias that was installed by a different package manager to "node_modules/.ignored  WARN  Moving @rollup/plugin-babel that was installed by a different package manager to "node_modules/.ignored  WARN  Moving @rollup/plugin-commonjs that was installed by a different package manager to "node_modules/.ignored  WARN  68 other warnings  WARN  deprecated [email protected]: This package has been deprecated and is no longer maintained. Please use @rollup/plugin-babel.  WARN  deprecated [email protected]: babel-eslint is now @babel/eslint-parser. This package will no longer receive updates.  WARN  deprecated [email protected]: We've written a new parser that's 6x faster and is backwards compatible. Please use @formatjs/icu-messageformat-parser  WARN  deprecated @formatjs/[email protected]: the package is rather renamed to @formatjs/ecma-abstract with some changes in functionality (primarily selectUnit is removed and we don't plan to make anyfurther changes to this package  WARN  deprecated [email protected]: This SVGO version is no longer supported. Upgrade to v2.x.x.  WARN  deprecated [email protected]: request has been deprecated, see https://github.com/request/request/issues/3142  WARN  deprecated [email protected]: We've written a new parser that's 6x faster and is backwards compatible. Please use @formatjs/icu-messageformat-parser  WARN  deprecated @formatjs/[email protected]: the package is rather renamed to @formatjs/ecma-abstract with some changes in functionality (primarily selectUnit is removed and we don't plan to make anyfurther changes to this package  WARN  deprecated @formatjs/[email protected]: the package is rather renamed to @formatjs/ecma-abstract with some changes in functionality (primarily selectUnit is removed and we don't plan to make anyfurther changes to this package  WARN  deprecated @formatjs/[email protected]: the package is rather renamed to @formatjs/ecma-abstract with some changes in functionality (primarily selectUnit is removed and we don't plan to make anyfurther changes to this package  WARN  deprecated @formatjs/[email protected]: the package is rather renamed to @formatjs/ecma-abstract with some changes in functionality (primarily selectUnit is removed and we don't plan to make anyfurther changes to this package  WARN  deprecated @formatjs/[email protected]: the package is rather renamed to @formatjs/ecma-abstract with some changes in functionality (primarily selectUnit is removed and we don't plan to make anyfurther changes to this package  WARN  deprecated [email protected]: some dependency vulnerabilities fixed, support for node < 10 dropped, and newer ECMAScript syntax/features added  WARN  deprecated [email protected]: See https://github.com/lydell/source-map-resolve#deprecated  WARN  deprecated [email protected]: The querystring API is considered Legacy. new code should use the URLSearchParams API instead.  WARN  deprecated [email protected]: Chokidar 2 does not receive security updates since 2019. Upgrade to chokidar 3 with 15x fewer dependencies  WARN  deprecated [email protected]: this library is no longer supported  WARN  deprecated [email protected]: Please upgrade to version 7 or higher. Older versions may use Math.random() in certain circumstances, which is known to be problematic. See https://v8.dev/blog/math-random for details.  WARN  deprecated [email protected]: request has been deprecated, see https://github.com/request/request/issues/3142  WARN  deprecated [email protected]: This version of tar is no longer supported, and will not receive security updates. Please upgrade asap.  WARN  deprecated [email protected]: The querystring API is considered Legacy. new code should use the URLSearchParams API instead.  WARN  deprecated [email protected]: Please upgrade to version 7 or higher. Older versions may use Math.random() in certain circumstances, which is known to be problematic. See https://v8.dev/blog/math-random for details.  WARN  deprecated [email protected]: fsevents 1 will break on node v14+ and could be using insecure binaries. Upgrade to fsevents 2.  WARN  deprecated [email protected]: See https://github.com/lydell/source-map-url#deprecated  WARN  deprecated [email protected]: https://github.com/lydell/resolve-url#deprecated  WARN  deprecated [email protected]: Please see https://github.com/lydell/urix#deprecated  WARN  deprecated [email protected]: This SVGO version is no longer supported. Upgrade to v2.x.x.  WARN  deprecated [email protected]: Please upgrade to version 7 or higher. Older versions may use Math.random() in certain circumstances, which is known to be problematic. See https://v8.dev/blog/math-random for details. Packages: +2055 +++++++++++++++++++++++++++++++++++++++++++++++++++++++++++++++++++++++++++++++++++++++++++++++++++++++++++++++++++++++++++++++++++++++++++++++++++++++++++++++++++++++++++++++++++++++++++++++++++++++ Progress: resolved 2057, reused 2055, downloaded 0, added 0, done node_modules/.pnpm/[email protected]/node_modules/core-js: Running postinstall script, done in 74ms node_modules/.pnpm/[email protected]/node_modules/core-js-pure: Running postinstall script, done in 75ms node_modules/.pnpm/[email protected]/node_modules/cwebp-bin: Running postinstall script... node_modules/.pnpm/[email protected]/node_modules/gifsicle: Running postinstall script... node_modules/.pnpm/[email protected]/node_modules/husky: Running install script, done in 122ms node_modules/.pnpm/[email protected]/node_modules/mozjpeg: Running postinstall script... node_modules/.pnpm/[email protected]/node_modules/node-sass: Running install script, done in 240ms node_modules/.pnpm/[email protected]/node_modules/husky: Running postinstall script, done in 75ms node_modules/.pnpm/[email protected]/node_modules/optipng-bin: Running postinstall script, failed in 2.2s .../node_modules/optipng-bin postinstall$ node lib/install.js │ ⚠ spawn /home/marcel/clones/work/ui/node_modules/.pnpm/[email protected]/node_modules/optipng-bin/vendor/optipng ENOENT │ ⚠ optipng pre-build test failed │ ℹ compiling from source │ ✖ Error: Command failed: /bin/sh -c make install │ pngrtran.c:99:1: warning: ‘png_rtran_ok’ defined but not used [-Wunused-function] │ 99 | png_rtran_ok(png_structrp png_ptr, int need_IHDR) │ | ^~~~~~~~~~~~ │ ar: `u' modifier ignored since `D' is the default (see `U') │ /nix/store/cimp3vp40msz4afq1c3602p2rn9bff0d-binutils-2.35.2/bin/ld: pngtest.o: undefined reference to symbol '[email protected]@GLIBC_2.2.5' │ /nix/store/cimp3vp40msz4afq1c3602p2rn9bff0d-binutils-2.35.2/bin/ld: /nix/store/6w8g7njm4mck5dmjxws0z1xnrxvl81xa-glibc-2.34-115/lib/libc.so.6: error adding symbols: DSO missing from command line │ make[2]: *** [Makefile:66: pngtest] Error 1 │ make[1]: *** [Makefile:129: ../libpng/libpng.a] Error 2 │ make: *** [Makefile:14: install] Error 2 │ cd src/optipng && \ │ make install && \ │ cd ../.. │ make[1]: Entering directory '/run/user/1000/b7494102-1171-4338-9d39-9cb813b83231/src/optipng' │ cd ../libpng && \ │ make -f Makefile PNGLIBCONF_H_PREBUILT=pnglibconf.h.optipng && \ │ cd ../optipng │ make[2]: Entering directory '/run/user/1000/b7494102-1171-4338-9d39-9cb813b83231/src/libpng' │ cp pnglibconf.h.optipng pnglibconf.h │ gcc -c -I../zlib -O2 -Wall -Wextra -o png.o png.c │ gcc -c -I../zlib -O2 -Wall -Wextra -o pngerror.o pngerror.c │ gcc -c -I../zlib -O2 -Wall -Wextra -o pngget.o pngget.c │ gcc -c -I../zlib -O2 -Wall -Wextra -o pngmem.o pngmem.c │ gcc -c -I../zlib -O2 -Wall -Wextra -o pngpread.o pngpread.c │ gcc -c -I../zlib -O2 -Wall -Wextra -o pngread.o pngread.c │ gcc -c -I../zlib -O2 -Wall -Wextra -o pngrio.o pngrio.c │ gcc -c -I../zlib -O2 -Wall -Wextra -o pngrtran.o pngrtran.c │ gcc -c -I../zlib -O2 -Wall -Wextra -o pngrutil.o pngrutil.c │ gcc -c -I../zlib -O2 -Wall -Wextra -o pngset.o pngset.c │ gcc -c -I../zlib -O2 -Wall -Wextra -o pngtrans.o pngtrans.c │ gcc -c -I../zlib -O2 -Wall -Wextra -o pngwio.o pngwio.c │ gcc -c -I../zlib -O2 -Wall -Wextra -o pngwrite.o pngwrite.c │ gcc -c -I../zlib -O2 -Wall -Wextra -o pngwtran.o pngwtran.c │ gcc -c -I../zlib -O2 -Wall -Wextra -o pngwutil.o pngwutil.c │ ar cru libpng.a png.o pngerror.o pngget.o pngmem.o pngpread.o pngread.o pngrio.o pngrtran.o pngrutil.o pngset.o pngtrans.o pngwio.o pngwrite.o pngwtran.o pngwutil.o │ ranlib libpng.a │ gcc -c -I../zlib -O2 -Wall -Wextra -o pngtest.o pngtest.c │ ld -L../zlib -o pngtest pngtest.o libpng.a -lz -lm │ make[2]: Leaving directory '/run/user/1000/b7494102-1171-4338-9d39-9cb813b83231/src/libpng' │ make[1]: Leaving directory '/run/user/1000/b7494102-1171-4338-9d39-9cb813b83231/src/optipng' │ at /home/marcel/clones/work/ui/node_modules/.pnpm/[email protected]/node_modules/execa/index.js:231:11 │ at runMicrotasks () │ at processTicksAndRejections (internal/process/task_queues.js:95:5) │ at async /home/marcel/clones/work/ui/node_modules/.pnpm/[email protected]/node_modules/optipng-bin/lib/install.js:18:4 └─ Failed in 2.2s node_modules/.pnpm/[email protected]/node_modules/node-sass: Running postinstall script, done in 270ms node_modules/.pnpm/[email protected]/node_modules/pngquant-bin: Running postinstall script, done in 487ms  ELIFECYCLE  Command failed with exit code 1.
  • Google Photos on MagicMirror
    2 projects | reddit.com/r/MagicMirror | 12 Apr 2022
    npm WARN deprecated [email protected]: this library is no longer supported npm WARN deprecated [email protected]: Please upgrade to version 7 or higher. Older versions may use Math.random() in certain circumstances, which is known to be problematic. See https://v8.dev/blog/math-random for details. npm WARN deprecated [email protected]: request has been deprecated, see https://github.com/request/request/issues/3142 npm WARN deprecated [email protected]: Critical security vulnerability fixed in v0.21.1. For more information, see https://github.com/axios/axios/pull/3410 npm WARN deprecated [email protected]: Critical security vulnerability fixed in v0.21.1. For more information, see https://github.com/axios/axios/pull/3410 npm WARN deprecated [email protected]: Critical security vulnerability fixed in v0.21.1. For more information, see https://github.com/axios/axios/pull/3410 added 205 packages, and audited 206 packages in 35s 6 packages are looking for funding run `npm fund` for details 7 high severity vulnerabilities To address all issues (including breaking changes), run: npm audit fix --force Run `npm audit` for details.
  • 11 JavaScript Examples to Source Code That Reveal Design Patterns In Use
    13 projects | dev.to | 20 Mar 2022
    The request library uses this pattern on nearly all of their class objects.
  • The Fetch API is finally coming to Node.js
    2 projects | dev.to | 10 Mar 2022
    Long before the addition of the Fetch API, the request module was the most popular method for making HTTP requests in Node. But the JavaScript ecosystem at large quickly evolved, and newly introduced patterns made request obsolete. A crucial example here is async/await; there was no provision for this in the request API, and the project was later deprecated due to these limitations.
  • not able to download truffle suite
    3 projects | reddit.com/r/BlockchainDevs | 21 Feb 2022
    npm WARN deprecated [email protected]: request has been deprecated, see https://github.com/request/request/issues/3142
  • A note from our sponsor - Appwrite
    appwrite.io | 1 Feb 2023
    Appwrite is an open source backend server that helps you build native iOS applications much faster with realtime APIs for authentication, databases, files storage, cloud functions and much more! Learn more →

Stats

Basic request repo stats
49
25,594
0.0
20 days ago
Write Clean JavaScript Code. Always.
Sonar helps you commit clean code every time. With over 300 unique rules to find JavaScript bugs, code smells & vulnerabilities, Sonar finds the issues while you focus on the work.
www.sonarsource.com